{"text_format":"1","workbook":"xlsx","n_sheets":6,"sheets":["DEMANDE","ANALYSE","Formulaire_réclamation","Exemple","LISTES","INFOS"],"not_rendered":{"charts":0,"images":0,"macros":1,"external_links":0,"defined_names":3,"comments":3,"pivot_tables":0},"unopened":[],"bounds":{"document_bytes":16777216,"sheet_cells":100000,"rows_first":2000,"rows_last":500,"rows_between":2000,"halvings":0,"cell_chars":16384,"cell_head_chars":4096},"cells_cut":0,"cells_raw":0,"read":"whole","date_system":"1900"}

{"sheet":"DEMANDE","index":0,"n_rows":147,"n_cols":10,"rows_kept":147,"cut":false,"hidden":true,"merged":[[0,0,0,7],[109,2,109,5],[44,7,46,7],[111,2,111,5],[76,0,76,7],[77,0,88,7],[54,0,54,7],[62,0,62,7],[63,0,73,7],[94,1,94,7],[43,2,43,3],[2,0,2,7],[1,2,1,5],[14,5,14,6],[4,1,4,2],[6,1,6,2],[8,1,8,2],[114,0,114,7],[10,1,10,2],[16,5,16,6],[38,1,38,3],[39,6,39,7],[26,1,26,3],[25,0,25,7],[42,0,42,7],[45,2,45,3],[46,2,46,3],[22,1,22,6],[39,0,39,3],[40,0,40,3],[122,0,122,7],[146,3,146,4],[48,2,48,3],[49,2,49,3],[50,2,50,3],[145,3,145,4],[47,7,51,7],[99,6,99,7],[97,1,97,7],[100,1,100,7],[103,1,103,7],[90,0,90,7],[47,2,47,3]]}
["Demande d'aide financière au Fonds d'intervention pour le développement du secteur agroalimentaire (FIDSA)"]
[null,null,"Formulaire demande individuelle"]
["Renseignements sur le demandeur et son représentant"]
[]
["Nom de l'entreprise",null,null,null,"Statut",null,null,null,null,1]
[]
["Répondant",null,null,null,"Production principale",null,null,null,null,1]
[]
["Adresse",null,null,null,"Présence de relève de moins de 45 ans au sein de l'entreprise"]
[null,null,null,null,null,null,null,null,null,1]
["Ville"]
[null,null,null,null,"Formation complétée et reconnue en agriculture"]
["MRC",null,null,null,null,null,null,null,null,1]
[null,null,null,null,null,null,null,null,null,1]
["Code postal",null,null,null,"Téléphone"]
[]
["Numéro d'identification ministériel (NIM)",null,null,null,"Courriel"]
[]
["Lien foncier avec l'emplacement du projet",null,null,null,null,null,null,null,null,1]
[]
["Municipalité où se déroule le projet",null,null,null,"Matricule du lot *"]
[null,null,null,null,"* seulement pour des aménagements réalisés sur un terrain dont le demandeur n'est pas propriétaire"]
["Titre du projet"]
[]
[]
["Liste des investissements prévus"]
["Investissements","Mesure",null,null,"Coût","Aide financière potentielle","Date \nde début","Date \nde fin"]
[null,null,null,null,null,{"$f":"MIN((E28*(IF(J28=3,60%,(IF(J28=4,30%,50%))))),(VLOOKUP(J28,LISTES!$A$14:$G$24,7,FALSE)))","v":0},null,null,null,1]
[null,null,null,null,null,{"$f":"MIN((E29*(IF(J29=3,60%,(IF(J29=4,30%,50%))))),(VLOOKUP(J29,LISTES!$A$14:$G$24,7,FALSE)))","v":0},null,null,null,1]
[null,null,null,null,null,{"$f":"MIN((E30*(IF(J30=3,60%,(IF(J30=4,30%,50%))))),(VLOOKUP(J30,LISTES!$A$14:$G$24,7,FALSE)))","v":0},null,null,null,1]
{"$rows_left_out":118}
{"sheet":"ANALYSE","index":1,"n_rows":198,"n_cols":15,"rows_kept":198,"cut":false,"hidden":true,"merged":[[186,2,186,3],[187,1,187,3],[188,0,188,3],[190,2,190,3],[26,15,26,17],[39,15,39,17],[180,1,180,2],[180,6,180,7],[101,0,101,8],[55,0,58,8],[93,0,96,8],[68,0,68,1],[69,0,69,1],[63,0,63,8],[64,2,64,3],[66,2,66,3],[24,0,24,8],[25,5,25,8],[25,0,25,4],[0,0,0,8],[6,4,6,5],[4,4,4,5],[6,6,6,8],[11,0,11,8],[10,0,10,8],[4,6,4,8],[5,6,5,8],[156,5,156,8],[103,6,103,8],[170,1,170,2],[177,1,177,2],[177,6,177,7],[173,1,173,2],[151,0,154,8],[104,6,115,8],[148,0,148,8],[165,0,168,8],[117,6,117,8],[140,0,143,8],[129,6,129,8],[64,0,64,1],[65,8,67,8],[73,2,73,3],[73,0,73,1],[69,2,69,3],[70,2,70,3],[71,2,71,3],[72,0,72,1],[65,0,65,1],[66,0,66,1],[67,0,67,1],[67,2,67,3],[68,2,68,3],[70,0,70,1],[71,0,71,1],[196,0,196,3],[197,0,197,3],[189,1,189,3],[191,2,191,3],[192,0,192,3],[193,0,193,3],[194,1,194,3],[195,0,195,3]]}
["Formulaire d'analyse de projet"]
[]
["Titre du projet: ",{"$f":"IF(DEMANDE!B23=\"\",\"\",DEMANDE!B23)","v":""}]
[]
["Nom de l'entreprise",{"$f":"IF(DEMANDE!B5=\"\",\"\",DEMANDE!B5)","v":""},null,null,"Numéro de projet : "]
["Répondant",{"$f":"IF(DEMANDE!B7=\"\",\"\",DEMANDE!B7)","v":""},null,null,null,"Date de réception du projet: "]
["Adresse",{"$f":"IF(DEMANDE!B9=\"\",\"\",DEMANDE!B9)","v":""},null,null,"Répondant MAPAQ :"]
["Ville",{"$f":"IF(DEMANDE!B11=\"\",\"\",DEMANDE!B11)","v":""}]
["Téléphone",{"$f":"IF(DEMANDE!F15=\"\",\"\",DEMANDE!F15)","v":""}]
[]
["Admissibilité de la demande et du promoteur"]
[]
["Entreprise enregistrée au MAPAQ (détient un NIM)",null,null,null,null,null,null,null,null,null,null,null,null,null,1]
[]
["Projet localisé sur le territoire de la Gaspésie ou des Îles-de-la-Madeleine",null,null,null,null,null,null,null,null,null,null,null,null,null,1]
[]
["L'entreprise est propriétaire de la parcelle sur laquelle se fera le projet ou détient un bail",null,null,null,null,null,null,null,null,null,null,null,null,null,1]
[]
["Promoteur considéré comme une relève avec plan d'affaires annexé à la demande",null,null,null,null,null,null,null,null,null,null,null,null,null,1]
[]
["Au moins un investissement présenté dans la demande est admissible à une aide",null,null,null,null,null,null,null,null,null,null,null,null,null,1]
[]
["Présences de soumissions pour les dépenses de plus de 5 000 $ "]
[null,null,null,null,null,null,null,null,null,null,null,null,null,null,1]
["Investissements prévus"]
["Demande du client",null,null,null,null,"Lettre d'offre"]
["Investissements","Mesures choisies par le client","Coût prévue","Aide financière","Échance prévue par le client","Mesures proposées","Coûts totaux","Coût admissible","Aide financière"]
[{"$f":"IF(DEMANDE!A28=\"\",\"\",DEMANDE!A28)","v":""},{"$f":"IF(A28=\"\",\"\",IFERROR(VLOOKUP(N28,LISTES!$A$14:$B$24,2),\"\"))","v":""},{"$f":"DEMANDE!E28","v":0},{"$f":"DEMANDE!F28","v":0},{"$f":"IF(DEMANDE!H28=\"\",\"\",DEMANDE!H28)","v":""},null,null,null,{"$f":"MIN(MIN(50000,(H28*(IF(O28=3,60%,(IF(O28=4,30%,50%)))))),VLOOKUP(O28,LISTES!$A$14:$H$25,7))","v":0},null,null,null,null,{"$f":"DEMANDE!J28","v":1},1]
[{"$f":"IF(DEMANDE!A29=\"\",\"\",DEMANDE!A29)","v":""},{"$f":"IF(A29=\"\",\"\",IFERROR(VLOOKUP(N29,LISTES!$A$14:$B$24,2),\"\"))","v":""},{"$f":"DEMANDE!E29","v":0},{"$f":"DEMANDE!F29","v":0},{"$f":"IF(DEMANDE!H29=\"\",\"\",DEMANDE!H29)","v":""},null,null,null,{"$f":"MIN((MIN(MIN(50000,(H29*(IF(O29=3,60%,(IF(O29=4,30%,50%)))))),VLOOKUP(O29,LISTES!$A$14:$H$25,7))),50000-I28)","v":0},null,null,null,null,{"$f":"DEMANDE!J29","v":1},1]
[{"$f":"IF(DEMANDE!A30=\"\",\"\",DEMANDE!A30)","v":""},{"$f":"IF(A30=\"\",\"\",IFERROR(VLOOKUP(N30,LISTES!$A$14:$B$24,2),\"\"))","v":""},{"$f":"DEMANDE!E30","v":0},{"$f":"DEMANDE!F30","v":0},{"$f":"IF(DEMANDE!H30=\"\",\"\",DEMANDE!H30)","v":""},null,null,null,{"$f":"MIN((MIN(MIN(50000,(H30*(IF(O30=3,60%,(IF(O30=4,30%,50%)))))),VLOOKUP(O30,LISTES!$A$14:$H$25,7))),50000-I29-I28)","v":0},null,null,null,null,{"$f":"DEMANDE!J30","v":1},1]
{"$rows_left_out":169}
{"sheet":"Formulaire_réclamation","index":2,"n_rows":83,"n_cols":19,"rows_kept":83,"cut":false,"hidden":false,"merged":[[6,1,6,2],[30,6,30,9],[0,0,0,9],[3,1,3,2],[3,5,3,6],[4,1,4,2],[4,5,4,6],[11,0,11,3],[11,4,11,6],[1,0,1,9],[5,1,5,2],[12,11,12,12],[76,2,76,4],[79,8,79,9],[12,15,12,16],[24,0,26,0],[27,3,27,5],[28,4,28,5],[30,0,30,5],[12,13,12,14]]}
["Formulaire de réclamation pour le FIDSA"]
["Compléter uniquement les sections en jaune"]
[]
["Nom de l'entreprise",null,null,null,"Numéro de projet : "]
["Répondant",null,null,null,"Répondant MAPAQ :"]
["Courriel"]
["Adresse",null,null,null,"Réclamation",1,{"$f":"SUMIF(I33:I68,1,S33:S68)+(SUMIF(I33:I68,1,S33:S68)*0.15*0.5)","v":0}]
["Ville",null,null,null,"Réclamation",2,{"$f":"SUMIF(I33:I68,2,S33:S68)+(SUMIF(I33:I68,2,S33:S68)*0.15*0.5)","v":0}]
["Téléphone",null,null,null,"Réclamation",3,{"$f":"SUMIF(I33:I68,3,S33:S68)+(SUMIF(I33:I68,3,S33:S68)*0.15*0.5)","v":0}]
[null,null,null,null,null,null,{"$f":"G7+G8+G9","v":0}]
[]
["Coût prévu et aide financière estimée",null,null,null,"Coût et aide du projet réalisé"]
["No associé à l'investissement initial","Description des dépenses figurant dans la lettre d'offre","Coût d'acquisition prévue","Aide financière demandée","Description des dépenses réalisés dans le projet","Coût d'acquisition réelle","Aide financière demandée",null,null,null,null,"Réclamation 1",null,"Réclamation 2",null,"Réclamation 3"]
[1,null,null,null,null,{"$f":"SUMIF($A$33:$A$68,A14,$G$33:$G$68)","v":0},{"$f":"SUMIF($A$33:$A$68,A14,$S$33:$S$68)","v":0},null,null,null,null,{"$f":"SUMIFS($G$33:$G$68,$A$33:$A$68,$A14,$I$33:$I$68,1)","v":0},{"$f":"L14*(IF(DEMANDE!J28=3,60%,(IF(DEMANDE!J28=4,30%,50%))))","v":0},{"$f":"SUMIFS($G$33:$G$68,$A$33:$A$68,$A14,$I$33:$I$68,2)","v":0},{"$f":"N14*(IF(DEMANDE!L28=3,60%,(IF(DEMANDE!L28=4,30%,50%))))","v":0},{"$f":"SUMIFS($G$33:$G$68,$A$33:$A$68,$A14,$I$33:$I$68,3)","v":0},{"$f":"P14*(IF(DEMANDE!N28=3,60%,(IF(DEMANDE!N28=4,30%,50%))))","v":0}]
[2,null,null,null,null,{"$f":"SUMIF($A$33:$A$68,A15,$G$33:$G$68)","v":0},{"$f":"SUMIF($A$33:$A$68,A15,$S$33:$S$68)","v":0},null,null,null,null,0,{"$f":"L15*(IF(DEMANDE!J29=3,60%,(IF(DEMANDE!J29=4,30%,50%))))","v":0},0,{"$f":"N15*(IF(DEMANDE!L29=3,60%,(IF(DEMANDE!L29=4,30%,50%))))","v":0},0,{"$f":"P15*(IF(DEMANDE!N29=3,60%,(IF(DEMANDE!N29=4,30%,50%))))","v":0}]
[3,null,null,null,null,0,0,null,null,null,null,0,{"$f":"L16*(IF(DEMANDE!J30=3,60%,(IF(DEMANDE!J30=4,30%,50%))))","v":0},0,{"$f":"N16*(IF(DEMANDE!L30=3,60%,(IF(DEMANDE!L30=4,30%,50%))))","v":0},0,{"$f":"P16*(IF(DEMANDE!N30=3,60%,(IF(DEMANDE!N30=4,30%,50%))))","v":0}]
[4,null,null,null,null,0,0,null,null,null,null,0,{"$f":"L17*(IF(DEMANDE!J31=3,60%,(IF(DEMANDE!J31=4,30%,50%))))","v":0},0,{"$f":"N17*(IF(DEMANDE!L31=3,60%,(IF(DEMANDE!L31=4,30%,50%))))","v":0},0,{"$f":"P17*(IF(DEMANDE!N31=3,60%,(IF(DEMANDE!N31=4,30%,50%))))","v":0}]
[5,null,null,null,null,0,0,null,null,null,null,0,{"$f":"L18*(IF(DEMANDE!J32=3,60%,(IF(DEMANDE!J32=4,30%,50%))))","v":0},0,{"$f":"N18*(IF(DEMANDE!L32=3,60%,(IF(DEMANDE!L32=4,30%,50%))))","v":0},0,{"$f":"P18*(IF(DEMANDE!N32=3,60%,(IF(DEMANDE!N32=4,30%,50%))))","v":0}]
[6,null,null,null,null,0,0,null,null,null,null,0,{"$f":"L19*(IF(DEMANDE!J33=3,60%,(IF(DEMANDE!J33=4,30%,50%))))","v":0},0,{"$f":"N19*(IF(DEMANDE!L33=3,60%,(IF(DEMANDE!L33=4,30%,50%))))","v":0},0,{"$f":"P19*(IF(DEMANDE!N33=3,60%,(IF(DEMANDE!N33=4,30%,50%))))","v":0}]
[7,null,null,null,null,0,0,null,null,null,null,0,{"$f":"L20*(IF(DEMANDE!J34=3,60%,(IF(DEMANDE!J34=4,30%,50%))))","v":0},0,{"$f":"N20*(IF(DEMANDE!L34=3,60%,(IF(DEMANDE!L34=4,30%,50%))))","v":0},0,{"$f":"P20*(IF(DEMANDE!N34=3,60%,(IF(DEMANDE!N34=4,30%,50%))))","v":0}]
[8,null,null,null,null,0,0,null,null,null,null,0,{"$f":"L21*(IF(DEMANDE!J35=3,60%,(IF(DEMANDE!J35=4,30%,50%))))","v":0},0,{"$f":"N21*(IF(DEMANDE!L35=3,60%,(IF(DEMANDE!L35=4,30%,50%))))","v":0},0,{"$f":"P21*(IF(DEMANDE!N35=3,60%,(IF(DEMANDE!N35=4,30%,50%))))","v":0}]
[9,null,null,null,null,0,0,null,null,null,null,0,{"$f":"L22*(IF(DEMANDE!J36=3,60%,(IF(DEMANDE!J36=4,30%,50%))))","v":0},0,{"$f":"N22*(IF(DEMANDE!L36=3,60%,(IF(DEMANDE!L36=4,30%,50%))))","v":0},0,{"$f":"P22*(IF(DEMANDE!N36=3,60%,(IF(DEMANDE!N36=4,30%,50%))))","v":0}]
[10,null,null,null,null,0,0,null,null,null,null,0,{"$f":"L23*(IF(DEMANDE!J37=3,60%,(IF(DEMANDE!J37=4,30%,50%))))","v":0},0,{"$f":"N23*(IF(DEMANDE!L37=3,60%,(IF(DEMANDE!L37=4,30%,50%))))","v":0},0,{"$f":"P23*(IF(DEMANDE!N37=3,60%,(IF(DEMANDE!N37=4,30%,50%))))","v":0}]
[11,null,null,null,null,0,0,null,null,null,null,0,{"$f":"L24*(IF(DEMANDE!J38=3,60%,(IF(DEMANDE!J38=4,30%,50%))))","v":0},0,{"$f":"N24*(IF(DEMANDE!L38=3,60%,(IF(DEMANDE!L38=4,30%,50%))))","v":0},0,{"$f":"P24*(IF(DEMANDE!N38=3,60%,(IF(DEMANDE!N38=4,30%,50%))))","v":0}]
[null,"Coût du projet et aide financière",{"$f":"SUM(C14:C24)","v":0},{"$f":"MIN(SUM(D14:D24),50000)","v":0},"Coût du projet et aide financière",{"$f":"SUM(F14:F24)","v":0},{"$f":"MIN(50000,SUM(G14:G24))","v":0},null,null,null,null,{"$f":"SUM(L14:L24)","v":0},0,0,0,0,0]
[null,"Frais de gestion (15 %)",{"$f":"D25*0.15","v":0},{"$f":"MAX(MIN((50000-D25),(C26*0.5)),0)","v":0},"Frais de gestion (15 %)",{"$f":"0.15*SUM(G14:G24)","v":0},{"$f":"MIN((F26*50%),(50000-G25))","v":0}]
[null,null,{"$f":"C25+C26","v":0},{"$f":"MIN(50000,D25+D26)","v":0},null,{"$f":"F25+F26","v":0},{"$f":"MIN(50000,G25+G26)","v":0}]
[null,null,null,"Solde ou dépassement (en négatif) de l'engagement initial :",null,null,{"$f":"D27-G27","v":0}]
[null,null,null,null,"Dépassement de l'engagement initial (en %) :",null,{"$f":"IFERROR(IF(G25>D25,-(G28/D25),0),\"\")","v":0}]
[]
{"$rows_left_out":54}
{"sheet":"Exemple","index":3,"n_rows":80,"n_cols":18,"rows_kept":80,"cut":false,"hidden":false,"merged":[[5,1,5,2],[0,0,0,10],[3,1,3,2],[3,5,3,6],[4,1,4,2],[4,5,4,6],[1,0,1,10],[6,1,6,2],[7,1,7,2],[11,0,11,3],[11,4,11,6],[12,12,12,13],[76,2,76,4],[79,9,79,10],[12,16,12,17],[24,0,26,0],[27,3,27,5],[28,4,28,5],[30,0,30,5],[30,6,30,10],[12,14,12,15]]}
["Formulaire de réclamation pour le FIDSA"]
["Compléter uniquement les sections en jaune"]
[]
["Nom de l'entreprise","Ferme AA",null,null,"Numéro de projet : "]
["Répondant","Diane B.",null,null,"Répondant MAPAQ :"]
["Adresse","rang 2"]
["Ville","Caplan",null,null,"Réclamation",1,{"$f":"SUMIF(J33:J68,1,I33:I68)+(SUMIF(J33:J68,1,I33:I68)*0.15*0.5)","v":29238.924999999999}]
["Téléphone","123-456-7899",null,null,"Réclamation",2,{"$f":"SUMIF(J33:J68,2,I33:I68)+(SUMIF(J33:J68,2,I33:I68)*0.15*0.5)","v":0}]
[null,null,null,null,"Réclamation",3,{"$f":"SUMIF(J33:J68,3,I33:I68)+(SUMIF(J33:J68,3,I33:I68)*0.15*0.5)","v":0}]
[null,null,null,null,null,null,{"$f":"G7+G8+G9","v":29238.924999999999}]
[]
["Coût prévu et aide financière estimée",null,null,null,"Coût et aide du projet réalisé"]
["No associé à l'investissement initial","Investissements prévus dans la lettre d'offre","Coût d'acquisition prévue","Aide financière demandée","Investissements réalisés dans le projet","Coût d'acquisition réelle","Aide financière demandée",null,null,null,null,null,"Réclamation 1",null,"Réclamation 2",null,"Réclamation 3"]
[1,"Agrandissement 35x60",70000,35000,"Agrandissement 30 x 50 '",{"$f":"SUMIF($A$33:$A$68,A14,$G$33:$G$68)","v":44000},{"$f":"SUMIF($A$33:$A$68,A14,$I$33:$I$68)","v":22000},null,null,null,null,null,{"$f":"SUMIFS($G$33:$G$68,$A$33:$A$68,$A14,$J$33:$J$68,1)","v":44000},{"$f":"M14*(IF(DEMANDE!J28=3,60%,(IF(DEMANDE!J28=4,30%,50%))))","v":22000},{"$f":"SUMIFS($G$33:$G$68,$A$33:$A$68,$A14,$J$33:$J$68,2)","v":0},{"$f":"O14*(IF(DEMANDE!L28=3,60%,(IF(DEMANDE!L28=4,30%,50%))))","v":0},{"$f":"SUMIFS($G$33:$G$68,$A$33:$A$68,$A14,$J$33:$J$68,3)","v":0},{"$f":"Q14*(IF(DEMANDE!N28=3,60%,(IF(DEMANDE!N28=4,30%,50%))))","v":0}]
[2,"50 agnelles",20000,6000,"Achat de 35 agnelles",{"$f":"SUMIF($A$33:$A$68,A15,$G$33:$G$68)","v":13500},{"$f":"SUMIF($A$33:$A$68,A15,$I$33:$I$68)","v":4050},null,null,null,null,null,13500,{"$f":"M15*(IF(DEMANDE!J29=3,60%,(IF(DEMANDE!J29=4,30%,50%))))","v":6750},0,{"$f":"O15*(IF(DEMANDE!L29=3,60%,(IF(DEMANDE!L29=4,30%,50%))))","v":0},0,{"$f":"Q15*(IF(DEMANDE!N29=3,60%,(IF(DEMANDE!N29=4,30%,50%))))","v":0}]
[3,"Cage et balance",3000,1500,"Cage et balance",2298,1149,null,null,null,null,null,2298,{"$f":"M16*(IF(DEMANDE!J30=3,60%,(IF(DEMANDE!J30=4,30%,50%))))","v":1149},0,{"$f":"O16*(IF(DEMANDE!L30=3,60%,(IF(DEMANDE!L30=4,30%,50%))))","v":0},0,{"$f":"Q16*(IF(DEMANDE!N30=3,60%,(IF(DEMANDE!N30=4,30%,50%))))","v":0}]
[4,null,null,null,null,0,0,null,null,null,null,null,0,{"$f":"M17*(IF(DEMANDE!J31=3,60%,(IF(DEMANDE!J31=4,30%,50%))))","v":0},0,{"$f":"O17*(IF(DEMANDE!L31=3,60%,(IF(DEMANDE!L31=4,30%,50%))))","v":0},0,{"$f":"Q17*(IF(DEMANDE!N31=3,60%,(IF(DEMANDE!N31=4,30%,50%))))","v":0}]
[5,null,null,null,null,0,0,null,null,null,null,null,0,{"$f":"M18*(IF(DEMANDE!J32=3,60%,(IF(DEMANDE!J32=4,30%,50%))))","v":0},0,{"$f":"O18*(IF(DEMANDE!L32=3,60%,(IF(DEMANDE!L32=4,30%,50%))))","v":0},0,{"$f":"Q18*(IF(DEMANDE!N32=3,60%,(IF(DEMANDE!N32=4,30%,50%))))","v":0}]
[6,null,null,null,null,0,0,null,null,null,null,null,0,{"$f":"M19*(IF(DEMANDE!J33=3,60%,(IF(DEMANDE!J33=4,30%,50%))))","v":0},0,{"$f":"O19*(IF(DEMANDE!L33=3,60%,(IF(DEMANDE!L33=4,30%,50%))))","v":0},0,{"$f":"Q19*(IF(DEMANDE!N33=3,60%,(IF(DEMANDE!N33=4,30%,50%))))","v":0}]
[7,null,null,null,null,0,0,null,null,null,null,null,0,{"$f":"M20*(IF(DEMANDE!J34=3,60%,(IF(DEMANDE!J34=4,30%,50%))))","v":0},0,{"$f":"O20*(IF(DEMANDE!L34=3,60%,(IF(DEMANDE!L34=4,30%,50%))))","v":0},0,{"$f":"Q20*(IF(DEMANDE!N34=3,60%,(IF(DEMANDE!N34=4,30%,50%))))","v":0}]
[8,null,null,null,null,0,0,null,null,null,null,null,0,{"$f":"M21*(IF(DEMANDE!J35=3,60%,(IF(DEMANDE!J35=4,30%,50%))))","v":0},0,{"$f":"O21*(IF(DEMANDE!L35=3,60%,(IF(DEMANDE!L35=4,30%,50%))))","v":0},0,{"$f":"Q21*(IF(DEMANDE!N35=3,60%,(IF(DEMANDE!N35=4,30%,50%))))","v":0}]
[9,null,null,null,null,0,0,null,null,null,null,null,0,{"$f":"M22*(IF(DEMANDE!J36=3,60%,(IF(DEMANDE!J36=4,30%,50%))))","v":0},0,{"$f":"O22*(IF(DEMANDE!L36=3,60%,(IF(DEMANDE!L36=4,30%,50%))))","v":0},0,{"$f":"Q22*(IF(DEMANDE!N36=3,60%,(IF(DEMANDE!N36=4,30%,50%))))","v":0}]
[10,null,null,null,null,0,0,null,null,null,null,null,0,{"$f":"M23*(IF(DEMANDE!J37=3,60%,(IF(DEMANDE!J37=4,30%,50%))))","v":0},0,{"$f":"O23*(IF(DEMANDE!L37=3,60%,(IF(DEMANDE!L37=4,30%,50%))))","v":0},0,{"$f":"Q23*(IF(DEMANDE!N37=3,60%,(IF(DEMANDE!N37=4,30%,50%))))","v":0}]
[11,null,null,null,null,0,0,null,null,null,null,null,0,{"$f":"M24*(IF(DEMANDE!J38=3,60%,(IF(DEMANDE!J38=4,30%,50%))))","v":0},0,{"$f":"O24*(IF(DEMANDE!L38=3,60%,(IF(DEMANDE!L38=4,30%,50%))))","v":0},0,{"$f":"Q24*(IF(DEMANDE!N38=3,60%,(IF(DEMANDE!N38=4,30%,50%))))","v":0}]
[null,"Coût du projet et aide financière",{"$f":"SUM(C14:C24)","v":93000},{"$f":"SUM(D14:D24)","v":42500},"Coût du projet et aide financière",{"$f":"SUM(F14:F24)","v":59798},{"$f":"SUM(G14:G24)","v":27199},null,null,null,null,null,{"$f":"SUM(M14:M24)","v":59798},29899,0,0,0,0]
[null,"Frais de gestion (15 %)",{"$f":"D25*0.15","v":6375},{"$f":"MIN((50000-D25),(C26*0.5))","v":3187.5},"Frais de gestion (15 %)",{"$f":"0.15*SUM(G14:G24)","v":4079.85},{"$f":"F26*50%","v":2039.925}]
[null,null,{"$f":"C25+C26","v":99375},{"$f":"MIN(50000,D25+D26)","v":45687.5},null,{"$f":"F25+F26","v":63877.85},{"$f":"G25+G26","v":29238.924999999999}]
[null,null,null,"Solde ou dépassement (en négatif) de l'engagement initial :",null,null,{"$f":"D27-G27","v":16448.575000000001}]
[null,null,null,null,"Dépassement de l'engagement initial (en %) :",null,{"$f":"IFERROR(IF(G25>D25,-(G28/D25),0),\"\")","v":0}]
[]
{"$rows_left_out":51}
{"sheet":"LISTES","index":4,"n_rows":144,"n_cols":9,"rows_kept":144,"cut":false,"hidden":true,"merged":[]}
[]
[]
[null,"Démarrage (entreprise qui n'a pas encore de ventes)"]
[null,"Démarrage (entreprise en production depuis moins de 5 ans)"]
[null,"Transfert (au moins un nouveau propriétaire depuis moins de 5 ans)"]
[null,"Expansion (Production en croissance)"]
[null,"Consolidation (Production stable)"]
[]
[]
[null,"Au moins un propriétaire de moins de 45 ans, établi depuis moins de 5 ans"]
[null,"Au moins un propriétaire de moins de 45 ans"]
[null,"Tous les propriétaires ont plus de 45 ans"]
[]
[1]
[2,"1.A - Dév. entreprises : Aide - individuel",null,null,null,null,50000,{"$f":"SUMIF(ANALYSE!$O$28:$O$38,A15,ANALYSE!$I$28:$I$38)","v":0},{"$f":"IF(H15>G15,\"Oui\",\"Non\")","v":"Non"}]
[3,"1.A - Dév. entreprises : Aide - CUMA",null,null,null,null,50000,{"$f":"SUMIF(ANALYSE!$O$28:$O$38,A16,ANALYSE!$I$28:$I$38)","v":0},{"$f":"IF(H16>G16,\"Oui\",\"Non\")","v":"Non"}]
[4,"1.B - Dév. entreprises : Prod. animales durables - Achat d'animaux",null,null,null,null,25000,{"$f":"SUMIF(ANALYSE!$O$28:$O$38,A17,ANALYSE!$I$28:$I$38)","v":0},"Non"]
[5,"1.B - Dév. entreprises : Prod. animales durables - Amé. durables",null,null,null,null,25000,{"$f":"SUMIF(ANALYSE!$O$28:$O$38,A18,ANALYSE!$I$28:$I$38)","v":0},"Non"]
[6,"1.B - Dév. entreprises : Prod. animales durables - Dév. apiculture",null,null,null,null,25000,{"$f":"SUMIF(ANALYSE!$O$28:$O$38,A19,ANALYSE!$I$28:$I$38)","v":0},"Non"]
[7,"1.C - Dév. entreprises : Amé. sols et C.C. - Drainage et nivellement",null,null,null,null,50000,{"$f":"SUMIF(ANALYSE!$O$28:$O$38,A20,ANALYSE!$I$28:$I$38)","v":0},"Non"]
[8,"1.C - Dév. Entreprises : Amé. sols et C.C. - Cultures de couverture",null,null,null,null,5000,{"$f":"SUMIF(ANALYSE!$O$28:$O$38,A21,ANALYSE!$I$28:$I$38)","v":0},"Non"]
[9,"1.D - Dév. Entreprises : Relève et établissement",null,null,null,null,50000,{"$f":"SUMIF(ANALYSE!$O$28:$O$38,A22,ANALYSE!$I$28:$I$38)","v":0},"Non"]
[10,"1.E - Dév. Entreprises : Remise en culture d'une friche agricole",null,null,null,null,25000,{"$f":"SUMIF(ANALYSE!$O$28:$O$38,A23,ANALYSE!$I$28:$I$38)","v":0},"Non"]
[11,"4 - Dév. activités de transformation",null,null,null,null,50000,{"$f":"SUMIF(ANALYSE!$O$28:$O$38,A24,ANALYSE!$I$28:$I$38)","v":0},"Non"]
[null,null,null,null,null,null,null,{"$f":"SUM(H15:H24)","v":0}]
[]
[]
[1]
[2,"1.1 Réduire le déficit de fertilité des sols"]
[3,"1.2 Soutenir les producteurs dans l’adoption de bonnes pratiques visant l’amélioration de la santé des sols et leur rendement"]
{"$rows_left_out":115}
{"sheet":"INFOS","index":5,"n_rows":3,"n_cols":7,"rows_kept":3,"cut":false,"hidden":true,"merged":[]}
[]
[]
[null,null,{"$f":"DEMANDE!B5","v":0},{"$f":"DEMANDE!B7","v":0},{"$f":"DEMANDE!B9","v":0},{"$f":"DEMANDE!B11","v":0},{"$f":"DEMANDE!F15","v":0}]